Kingname

Python的单元测试(二)

Python的单元测试(一)中,我们讲了单元测试的概念以及一个简单的单元测试例子。

在这个例子中,只有三个函数,于是可以把每个函数的输出结果打印到屏幕上,再用肉眼去看结果是否符合预期。然而假设有一个程序,有二十个类,每个类又有几十个函数,有些函数的输出结果还多达几十行,在这种情况下,肉眼如何看得出?

当然你可以使用if判断

1
2
3
4
if 输出结果 == 预期结果:
return True
else:
print u'不相等'

这个时候,你发现,程序有几个函数,后三行就要重复几次,本着代码简洁的原则,你把这个判断的过程写到一个函数中:

1
2
3
4
5
def isequal(output,right_output):
if output == right_output:
return True
else:
print u'不相等'

那么恭喜你,你步入正规了,然而,这一切已经有人为你做好了。欢迎unittest模块出场。

unittest supports test automation, sharing of setup and shutdown code for tests, aggregation of tests into collections, and independence of the tests from the reporting framework. The unittest module provides classes that make it easy to support these qualities for a set of tests.

Python的官方文档这样写到,unittest支持自动化测试,测试的安装分享和关闭代码……

一句话说来,就是,unittest很好用。

还是用上一次的readandadd.py来演示unittest的基本用法,首先介绍unittest的一个函数,assertEqual(first,second),这个函数的作用是检查变量first的值与second的值是否相等,如果不相等就抛出错误。

先创建utest.py文件,输入以下代码并运行:

1
2
3
4
5
6
7
8
9
10
11
12
13
14
15
16
17
18
19
#-*-coding:utf-8-*-
import unittest
import readandadd
class basictest(unittest.TestCase): #类名可以随便取
def testread(self): #每个函数都要以test开头
output = readandadd.read('1.txt')
self.assertEqual(output,'2,3')
def testgetnum(self):
output = readandadd.getnum('2,3')
self.assertEqual(output,['2', '3'])
def testaddnum(self):
output = readandadd.addnum([2,3])
self.assertEqual(output,5)
if __name__ == '__main__':
unittest.main()

运行结果如下:

1
2
3
4
5
...
----------------------------------------------------------------------
Ran 3 tests in 0.001s
OK

你也许会说,就一个ok,什么都没有啊。那我先把testread()函数下面的

1
self.assertEqual(output,'2,3')

改为

1
self.assertEqual(output,'2,4')

在运行utest.py看看输出结果如何:

1
2
3
4
5
6
7
8
9
10
11
12
13
..F
======================================================================
FAIL: testread (__main__.basictest)
----------------------------------------------------------------------
Traceback (most recent call last):
File "E:/mystuff/unitest/utest.py", line 8, in testread
self.assertEqual(output,'2,4')
AssertionError: '2,3' != '2,4'
----------------------------------------------------------------------
Ran 3 tests in 0.000s
FAILED (failures=1)

这里准确的找出了错误的位置和错误的具体内容。注意看最上面,有个

1
..F

猜测它可能是标示错误的位置。保持testread的错误不改,再把testgetnum()函数中的以下内容

1
self.assertEqual(output,['2', '3'])

改为

1
self.assertEqual(output,['2', '6'])

再运行utest.py程序,输出结果如下:

1
2
3
4
5
6
7
8
9
10
11
12
13
14
15
16
17
18
19
20
21
22
23
24
25
26
27
28
29
30
31
32
.FF
======================================================================
FAIL: testgetnum (__main__.basictest)
----------------------------------------------------------------------
Traceback (most recent call last):
File "E:/mystuff/unitest/utest.py", line 12, in testgetnum
self.assertEqual(output,['2', '6'])
AssertionError: Lists differ: ['2', '3'] != ['2', '6']
First differing element 1:
3
6
- ['2', '3']
? ^
+ ['2', '6']
? ^
======================================================================
FAIL: testread (__main__.basictest)
----------------------------------------------------------------------
Traceback (most recent call last):
File "E:/mystuff/unitest/utest.py", line 8, in testread
self.assertEqual(output,'2,4')
AssertionError: '2,3' != '2,4'
----------------------------------------------------------------------
Ran 3 tests in 0.001s
FAILED (failures=2)

可以看出,这里分别把两个错误显示了出来。并且第一行变成了

1
.FF

所以,第一行的内容应该从右往左读,它标明错误函数在所有函数的相对位置。

现在再把testread()和testgetnum()改回去,再看看全部正确的输出:

1
2
3
4
5
...
----------------------------------------------------------------------
Ran 3 tests in 0.000s
OK

印证了那句话,没有消息就是最好的消息。

这篇文章介绍了单元测试模块unittest的assertEqual的基本用法,下一篇文章将要更加全面的介绍unittest模块。


本文首发地址:http://kingname.info/2015/03/04/pythonunittest2/

作者:青南 

转载请注明出处。

Kingname wechat
第一时间获取最新文章更新,请订阅我的微信公众号:未闻Code